BDBM50282462 CHEMBL352503::Quinazolinone Analog
SMILES CCCCOC(=O)NS(=O)(=O)c1ccccc1-c1ccc(Cn2c(CCC)nc3ccc(NC(=O)CCCC)cc3c2=O)cc1
InChI Key InChIKey=ANLRWKBJZGWBER-UHFFFAOYSA-N
Data  2 IC50
  Tab Delimited (TSV)   2D SDfile   Computed 3D by Vconf -m prep SDfile
Find this compound or compounds like it in BindingDB:
Activity Spreadsheet -- Enzyme Inhibition Constant Data from BindingDB
Found 1 hit for monomerid = 50282462
TargetType-1 angiotensin II receptor(RABBIT)
TBA
Curated by ChEMBL
LigandPNGBDBM50282462(CHEMBL352503 | Quinazolinone Analog)
Affinity DataIC50:  0.190nM. Assay description: Tested in vitro for binding affinity against Angiotensin II receptor, type 1 in rabbit aortic membrane
In DepthDetails Article